{"text_format":"1","workbook":"xlsx","n_sheets":10,"sheets":["Basic Inputs","Unit Prices","Flexible","Rigid","Alternate","DATABASE","Graphs","Report","Advanced Report","Instructions"],"not_rendered":{"charts":4,"images":29,"macros":1,"external_links":0,"defined_names":14,"comments":1,"pivot_tables":0},"unopened":[],"bounds":{"document_bytes":16777216,"sheet_cells":100000,"rows_first":2000,"rows_last":500,"rows_between":2000,"halvings":0,"cell_chars":16384,"cell_head_chars":4096},"cells_cut":0,"cells_raw":0,"read":"whole","date_system":"1900"}

{"sheet":"Basic Inputs","index":0,"n_rows":16,"n_cols":3,"rows_kept":16,"cut":false,"hidden":false,"merged":[[1,2,1,3],[4,2,4,3],[3,2,3,3]]}
[]
[null,null,"FLORIDA DEPARTMENT OF TRANSPORTATION"]
[]
[null,null,"PAVEMENT TYPE SELECTION SPREADSHEET"]
[null,null,"PROJECT DESCRIPTION:"]
[]
[null,null,"Financial Project ID:"]
[null,null,"State Road Number:"]
[null,null,"County:"]
[null,null,"Project Length:"]
{"$rows_left_out":7}
{"sheet":"Unit Prices","index":1,"n_rows":12,"n_cols":15,"rows_kept":12,"cut":false,"hidden":false,"merged":[[0,1,0,5],[4,7,4,9],[2,7,2,9],[5,7,5,9],[3,1,3,5],[1,1,1,5],[2,1,2,5],[3,7,3,9]]}
[null,"Note: It is Not Necessary to Enter the Standard Deviation for Normal Calculations."]
[]
[null,"Generic Example 1",null,null,null,null,null,"LINKS"]
[null,"LIST OF CONSTRUCTION ITEMS",null,null,null,null,null,"Specifications Office",null,null,null,null,null,null,"List of Units"]
[null,"Pay Item","Description","Mean Price","St. Deviation","Unit",null,"Preliminary Estimates",null,null,null,null,null,null,"Cu. Yd"]
[null,null,null,null,null,null,null,"Pavement Management Section",null,null,null,null,null,null,"Each"]
[null,null,null,null,null,null,null,null,null,null,null,null,null,null,"Ft"]
[null,null,null,null,null,null,null,null,null,null,null,null,null,null,"Gal."]
[null,null,null,null,null,null,null,null,null,null,null,null,null,null,"In"]
[null,null,null,null,null,null,null,null,null,null,null,null,null,null,"Sq. Ft"]
{"$rows_left_out":3}
{"sheet":"Flexible","index":2,"n_rows":103,"n_cols":27,"rows_kept":103,"cut":false,"hidden":false,"merged":[[86,1,86,4],[87,1,87,4],[88,1,88,4],[70,1,70,4],[82,1,82,4],[84,1,84,4],[85,1,85,4],[81,1,81,4],[78,1,78,4],[80,1,80,4],[61,1,61,4],[52,1,52,4],[62,1,62,4],[63,1,63,4],[79,1,79,4],[64,1,64,4],[66,1,66,4],[67,1,67,4],[68,1,68,4],[69,1,69,4],[50,1,50,4],[51,1,51,4],[60,1,60,4],[43,1,43,4],[44,1,44,4],[46,1,46,4],[45,1,45,4],[48,1,48,4],[49,1,49,4],[31,1,31,4],[32,1,32,4],[2,2,2,10],[3,2,3,10],[28,1,28,4],[30,1,30,4],[24,1,24,4],[25,1,25,4],[4,2,4,10],[22,1,22,4],[14,1,14,4],[42,1,42,4],[0,21,0,22],[19,1,19,4],[20,1,20,4],[21,1,21,4],[18,13,19,16],[17,13,17,16],[5,5,5,8],[0,18,0,20],[1,2,1,10],[0,13,0,16],[34,1,34,4],[23,1,23,4],[26,1,26,4],[27,1,27,4],[33,1,33,4]]}
[null,null,null,null,null,null,null,null,null,null,null,null,null,"TOOL BOX",null,null,null,null,"Design Options",null,null,"Calculation Options"]
[null,null,"LIFE CYCLE COST ANALYSIS",null,null,null,null,null,null,null,null,null,null,null,null,null,null,null,"Superpave Structural Course Density",145,"Lbs/Cu.Ft","Lower Side",2]
[null,null,"ASPHALT CONCRETE PAVEMENT DESIGN (FLEXIBLE PAVEMENT)",null,null,null,null,null,null,null,null,null,null,null,null,null,null,null,"Friction Course Density",135,"Lbs/Cu.Ft","Higher Side",2]
[null,null,{"$f":"IF('Basic Inputs'!$D$7=\"\",\"\",'Basic Inputs'!$C$7 & 'Basic Inputs'!$D$7 &\", \" & \"SR No.-\" &'Basic Inputs'!$D$8 & \", \" & \"County:\" & 'Basic Inputs'!$D$9)","v":""},{"$f":"IF('Basic Inputs'!$D$7=\"\",\"\",'Basic Inputs'!$C$7 & 'Basic Inputs'!$D$7)","v":""},{"$f":"IF('Basic Inputs'!$D$7=\"\",\"\",'Basic Inputs'!$C$7 & 'Basic Inputs'!$D$7)","v":""},{"$f":"IF('Basic Inputs'!$D$7=\"\",\"\",'Basic Inputs'!$C$7 & 'Basic Inputs'!$D$7)","v":""},{"$f":"IF('Basic Inputs'!$D$7=\"\",\"\",'Basic Inputs'!$C$7 & 'Basic Inputs'!$D$7)","v":""},{"$f":"IF('Basic Inputs'!$D$7=\"\",\"\",'Basic Inputs'!$C$7 & 'Basic Inputs'!$D$7)","v":""},{"$f":"IF('Basic Inputs'!$D$7=\"\",\"\",'Basic Inputs'!$C$7 & 'Basic Inputs'!$D$7)","v":""},{"$f":"IF('Basic Inputs'!$D$7=\"\",\"\",'Basic Inputs'!$C$7 & 'Basic Inputs'!$D$7)","v":""},{"$f":"IF('Basic Inputs'!$D$7=\"\",\"\",'Basic Inputs'!$C$7 & 'Basic Inputs'!$D$7)","v":""},null,null,null,null,null,null,null,"Tack Coat Spread Rate",0.5,"Gal/Sq.Yd"]
[null,null,{"$f":"IF('Basic Inputs'!$D$7=\"\",\"\",'Basic Inputs'!$C$10&\" \"&'Basic Inputs'!$D$10&\", \"&'Basic Inputs'!$C$11&\" \"&'Basic Inputs'!$D$11)","v":""},null,null,null,null,null,null,null,null,null,null,null,null,null,null,null,"Limerock Density",120,"Lbs/Cu.Ft"]
[null,"Definitions:",null,null,null,{"$f":"IF('Basic Inputs'!$D$7=\"\",\"\",'Basic Inputs'!$C$12&\" \"&'Basic Inputs'!$D$12&\", \"&'Basic Inputs'!$C$13&\" \"&'Basic Inputs'!$D$13)","v":""},null,null,null,null,null,null,null,null,null,null,null,null,"Subbase Density",110,"Lbs/Cu.Ft"]
[null,"Length of Section:",null,null,"Ft",null,null,null,null,null,"Analysis Period:"]
[null,"Passing Lane Width:",null,null,"Ft",null,null,null,null,null,"Discount Rate:"]
[null,"Travel Lane Width:",null,null,"Ft",null,null,null,null,null,"Initial Year of Construction:"]
[null,"Inside Shoulder Width:",null,null,"Ft",null,null,null,null,null,"No. of Passing Lanes:"]
{"$rows_left_out":94}
{"sheet":"Rigid","index":3,"n_rows":103,"n_cols":27,"rows_kept":103,"cut":false,"hidden":false,"merged":[[88,1,88,4],[69,1,69,4],[70,1,70,4],[82,1,82,4],[84,1,84,4],[81,1,81,4],[78,1,78,4],[79,1,79,4],[80,1,80,4],[62,1,62,4],[63,1,63,4],[85,1,85,4],[86,1,86,4],[87,1,87,4],[67,1,67,4],[68,1,68,4],[64,1,64,4],[66,1,66,4],[2,2,2,10],[25,1,25,4],[4,2,4,10],[5,5,5,8],[18,13,19,16],[17,13,17,16],[45,1,45,4],[46,1,46,4],[0,21,0,22],[0,18,0,20],[26,1,26,4],[3,2,3,10],[23,1,23,4],[24,1,24,4],[19,1,19,4],[20,1,20,4],[21,1,21,4],[22,1,22,4],[27,1,27,4],[14,1,14,4],[1,2,1,10],[0,13,0,16],[60,1,60,4],[61,1,61,4],[34,1,34,4],[28,1,28,4],[30,1,30,4],[33,1,33,4],[31,1,31,4],[32,1,32,4],[48,1,48,4],[49,1,49,4],[50,1,50,4],[51,1,51,4],[52,1,52,4],[42,1,42,4],[43,1,43,4],[44,1,44,4]]}
[null,null,null,null,null,null,null,null,null,null,null,null,null,"TOOL BOX",null,null,null,null,"Design Options",null,null,"Calculation Options"]
[null,null,"LIFE CYCLE COST ANALYSIS",null,null,null,null,null,null,null,null,null,null,null,null,null,null,null,"Superpave Structural Course Density",145,"Lbs/Cu.Ft","Lower Side",2]
[null,null,"JOINTED PLAIN CONCRETE PAVEMENT DESIGN (RIGID PAVEMENT)",null,null,null,null,null,null,null,null,null,null,null,null,null,null,null,"Friction Course Density",135,"Lbs/Cu.Ft","Higher Side",2]
[null,null,{"$f":"IF('Basic Inputs'!$D$7=\"\",\"\",'Basic Inputs'!$C$7 & 'Basic Inputs'!$D$7 &\", \" & \"SR No.-\" &'Basic Inputs'!$D$8 & \", \" & \"County:\" & 'Basic Inputs'!$D$9)","v":""},{"$f":"IF('Basic Inputs'!$D$7=\"\",\"\",'Basic Inputs'!$C$7 & 'Basic Inputs'!$D$7)","v":""},{"$f":"IF('Basic Inputs'!$D$7=\"\",\"\",'Basic Inputs'!$C$7 & 'Basic Inputs'!$D$7)","v":""},{"$f":"IF('Basic Inputs'!$D$7=\"\",\"\",'Basic Inputs'!$C$7 & 'Basic Inputs'!$D$7)","v":""},{"$f":"IF('Basic Inputs'!$D$7=\"\",\"\",'Basic Inputs'!$C$7 & 'Basic Inputs'!$D$7)","v":""},{"$f":"IF('Basic Inputs'!$D$7=\"\",\"\",'Basic Inputs'!$C$7 & 'Basic Inputs'!$D$7)","v":""},{"$f":"IF('Basic Inputs'!$D$7=\"\",\"\",'Basic Inputs'!$C$7 & 'Basic Inputs'!$D$7)","v":""},{"$f":"IF('Basic Inputs'!$D$7=\"\",\"\",'Basic Inputs'!$C$7 & 'Basic Inputs'!$D$7)","v":""},{"$f":"IF('Basic Inputs'!$D$7=\"\",\"\",'Basic Inputs'!$C$7 & 'Basic Inputs'!$D$7)","v":""},null,null,null,null,null,null,null,"Slab Length",15,"Ft"]
[null,null,{"$f":"IF('Basic Inputs'!$D$7=\"\",\"\",'Basic Inputs'!$C$10&\" \"&'Basic Inputs'!$D$10&\", \"&'Basic Inputs'!$C$11&\" \"&'Basic Inputs'!$D$11)","v":""},null,null,null,null,null,null,null,null,null,null,null,null,null,null,null,"Slab Width",10,"Ft"]
[null,"Definitions:",null,null,null,{"$f":"IF('Basic Inputs'!$D$7=\"\",\"\",'Basic Inputs'!$C$12&\" \"&'Basic Inputs'!$D$12&\", \"&'Basic Inputs'!$C$13&\" \"&'Basic Inputs'!$D$13)","v":""},null,null,null,null,null,null,null,null,null,null,null,null,"Base Course Density",120,"Lbs/Cu.Ft"]
[null,"Length of Section:",null,null,"Ft",null,null,null,null,null,"Analysis Period:",null,null,null,null,null,null,null,"CTPB Density",120,"Lbs/Cu.Ft"]
[null,"Passing Lane Width:",null,null,"Ft",null,null,null,null,null,"Discount Rate:"]
[null,"Travel Lane Width:",null,null,"Ft",null,null,null,null,null,"Initial Year of Construction:"]
[null,"Inside Shoulder Width:",null,null,"Ft",null,null,null,null,null,"No. of Passing Lanes:"]
{"$rows_left_out":94}
{"sheet":"Alternate","index":4,"n_rows":103,"n_cols":27,"rows_kept":103,"cut":false,"hidden":false,"merged":[[86,1,86,4],[88,1,88,4],[70,1,70,4],[82,1,82,4],[84,1,84,4],[85,1,85,4],[87,1,87,4],[50,1,50,4],[66,1,66,4],[67,1,67,4],[68,1,68,4],[69,1,69,4],[18,13,19,16],[17,13,17,16],[0,21,0,22],[34,1,34,4],[28,1,28,4],[30,1,30,4],[0,18,0,20],[26,1,26,4],[27,1,27,4],[14,1,14,4],[1,2,1,10],[0,13,0,16],[42,1,42,4],[43,1,43,4],[2,2,2,10],[3,2,3,10],[23,1,23,4],[24,1,24,4],[4,2,4,10],[5,5,5,8],[33,1,33,4],[19,1,19,4],[20,1,20,4],[21,1,21,4],[22,1,22,4],[31,1,31,4],[32,1,32,4],[25,1,25,4],[44,1,44,4],[45,1,45,4],[81,1,81,4],[60,1,60,4],[61,1,61,4],[62,1,62,4],[63,1,63,4],[78,1,78,4],[79,1,79,4],[80,1,80,4],[51,1,51,4],[52,1,52,4],[64,1,64,4],[46,1,46,4],[48,1,48,4],[49,1,49,4]]}
[null,null,null,null,null,null,null,null,null,null,null,null,null,"TOOL BOX",null,null,null,null,"Design Options",null,null,"Calculation Options"]
[null,null,"LIFE CYCLE COST ANALYSIS",null,null,null,null,null,null,null,null,null,null,null,null,null,null,null,"Superpave Structural Course Density",145,"Lbs/Cu.Ft","Lower Side",2]
[null,null,"COMPOSITE PAVEMENT DEISGN",null,null,null,null,null,null,null,null,null,null,null,null,null,null,null,"Friction Course Density",135,"Lbs/Cu.Ft","Higher Side",2]
[null,null,{"$f":"IF('Basic Inputs'!$D$7=\"\",\"\",'Basic Inputs'!$C$7 & 'Basic Inputs'!$D$7 &\", \" & \"SR No.-\" &'Basic Inputs'!$D$8 & \", \" & \"County:\" & 'Basic Inputs'!$D$9)","v":""},{"$f":"IF('Basic Inputs'!$D$7=\"\",\"\",'Basic Inputs'!$C$7 & 'Basic Inputs'!$D$7)","v":""},{"$f":"IF('Basic Inputs'!$D$7=\"\",\"\",'Basic Inputs'!$C$7 & 'Basic Inputs'!$D$7)","v":""},{"$f":"IF('Basic Inputs'!$D$7=\"\",\"\",'Basic Inputs'!$C$7 & 'Basic Inputs'!$D$7)","v":""},{"$f":"IF('Basic Inputs'!$D$7=\"\",\"\",'Basic Inputs'!$C$7 & 'Basic Inputs'!$D$7)","v":""},{"$f":"IF('Basic Inputs'!$D$7=\"\",\"\",'Basic Inputs'!$C$7 & 'Basic Inputs'!$D$7)","v":""},{"$f":"IF('Basic Inputs'!$D$7=\"\",\"\",'Basic Inputs'!$C$7 & 'Basic Inputs'!$D$7)","v":""},{"$f":"IF('Basic Inputs'!$D$7=\"\",\"\",'Basic Inputs'!$C$7 & 'Basic Inputs'!$D$7)","v":""},{"$f":"IF('Basic Inputs'!$D$7=\"\",\"\",'Basic Inputs'!$C$7 & 'Basic Inputs'!$D$7)","v":""},null,null,null,null,null,null,null,"Slab Panel Length",6,"Ft"]
[null,null,{"$f":"IF('Basic Inputs'!$D$7=\"\",\"\",'Basic Inputs'!$C$10&\" \"&'Basic Inputs'!$D$10&\", \"&'Basic Inputs'!$C$11&\" \"&'Basic Inputs'!$D$11)","v":""},null,null,null,null,null,null,null,null,null,null,null,null,null,null,null,"Slab Panel Width",6,"Ft"]
[null,"Definitions:",null,null,null,{"$f":"IF('Basic Inputs'!$D$7=\"\",\"\",'Basic Inputs'!$C$12&\" \"&'Basic Inputs'!$D$12&\", \"&'Basic Inputs'!$C$13&\" \"&'Basic Inputs'!$D$13)","v":""}]
[null,"Length of Section:",null,null,"Ft",null,null,null,null,null,"Analysis Period:"]
[null,"Passing Lane Width:",null,null,"Ft",null,null,null,null,null,"Discount Rate:"]
[null,"Travel Lane Width:",null,null,"Ft",null,null,null,null,null,"Initial Year of Construction:"]
[null,"Inside Shoulder Width:",null,null,"Ft",null,null,null,null,null,"No. of Passing Lanes:"]
{"$rows_left_out":94}
{"sheet":"DATABASE","index":5,"n_rows":518,"n_cols":256,"rows_kept":518,"cut":false,"hidden":true,"merged":[[167,0,283,0],[284,1,328,1],[401,0,517,0],[4,0,166,0],[401,1,445,1],[446,1,469,1],[470,1,493,1],[494,1,517,1],[329,1,352,1],[353,1,376,1],[4,1,16,1],[17,1,166,1],[167,1,211,1],[212,1,235,1],[236,1,259,1],[260,1,283,1],[377,1,400,1],[284,0,400,0]]}
["DATABASE",null,null,null,null,null,null,null,null,null,null,null,null,null,null,null,null,null,null,null,null,null,null,null,null,null,null,null,null,null,null,null,null,null,null,null,null,null,null,null,null,null,null,null,null,null,null,null,null,null,null,null,null,null,null,null,null,null,null,null,null,null,null,null,null,null,null,null,null,null,null,null,null,null,null,null,null,null,null,null,null,null,null,null,null,null,null,null,null,null,null,null,null,null,null,null,null,null,null,null,null,null,null,null,null,null,null,null,null,null,null,null,null,null,null,null,null,null,null,null,null,null,null,null,null,null,null,null,null,null,null,null,null,null,null,null,null,null,null,null,null,null,null,null,null,null,null,null,null,null,null,null,null,null,null,null,null,null,null,null,null,null,null,null,null,null,null,null,null,null,null,null,null,null,null,null,null,null,null,null,null,null,null,null,null,null,null,null,null,null,null,null,null,null,null,null,null,null,null,null,null,null,null,null,null,null,null,null,null,null,null,null,null,null,null,null,null,null,null,null,null,null,null,null,null,null,null,null,null,null,null,null,null,null,null,null,null,null,null,null,null,null,null,null,null,null,null,null,null,null,null,null,null,null,null,11]
[]
[]
[]
["COMMON ITEMS","BASIC INPUTS","Unique Identifier","Rural Arterial/Collector 2-Lane (2-Way)","Rural Arterial/Collector 4-Lane Divided","Rural Limited Access 4-Lane Divided","Urban 4-Lane Arterial Divided (45 Mph)","Urban 6-Lane Arterial Divided (< 45Mph)","Urban 5-Lane Arterial/Collector Undivided","Generic Example 1","Generic Example 2","Generic Example 3 - Advanced Option","Rural Limited Access 4-Lane Divided--Ver: ","Generic Example 1--Ver: Version-1",null,null,null,null,null,null,null,null,null,null,null,null,null,null,null,null,null,null,null,null,null,null,null,null,null,null,null,null,null,null,null,null,null,null,null,null,null,null,null,null,null,null,null,null,null,null,null,null,null,null,null,null,null,null,null,null,null,null,null,null,null,null,null,null,null,null,null,null,null,null,null,null,null,null,null,null,null,null,null,null,null,null,null,null,null,null,null,null,null,null,null,null,null,null,null,null,null,null,null,null,null,null,null,null,null,null,null,null,null,null,null,null,null,null,null,null,null,null,null,null,null,null,null,null,null,null,null,null,null,null,null,null,null,null,null,null,null,null,null,null,null,null,null,null,null,null,null,null,null,null,null,null,null,null,null,null,null,null,null,null,null,null,null,null,null,null,null,null,null,null,null,null,null,null,null,null,null,null,null,null,null,null,null,null,null,null,null,null,null,null,null,null,null,null,null,null,null,null,null,null,null,null,null,null,null,null,null,null,null,null,null,null,null,null,null,null,null,null,null,null,null,null,null,null,null,null,null,null,null,null,null,null,null,null,null,null,null,null,null,null,null,"Rural Arterial/Collector 2-Lane (2-Way)"]
[null,null,"Fin Project ID","Rural Arterial/Collector 2-Lane (2-Way)","Rural Arterial/Collector 4-Lane Divided","Rural Limited Access 4-Lane Divided","Urban 4-Lane Arterial Divided (45 Mph)","Urban 6-Lane Arterial Divided (< 45Mph)","Urban 5-Lane Arterial/Collector Undivided","Generic Example 1","Generic Example 2","Generic Example 3 - Advanced Option","Rural Limited Access 4-Lane Divided","Generic Example 1",null,null,null,null,null,null,null,null,null,null,null,null,null,null,null,null,null,null,null,null,null,null,null,null,null,null,null,null,null,null,null,null,null,null,null,null,null,null,null,null,null,null,null,null,null,null,null,null,null,null,null,null,null,null,null,null,null,null,null,null,null,null,null,null,null,null,null,null,null,null,null,null,null,null,null,null,null,null,null,null,null,null,null,null,null,null,null,null,null,null,null,null,null,null,null,null,null,null,null,null,null,null,null,null,null,null,null,null,null,null,null,null,null,null,null,null,null,null,null,null,null,null,null,null,null,null,null,null,null,null,null,null,null,null,null,null,null,null,null,null,null,null,null,null,null,null,null,null,null,null,null,null,null,null,null,null,null,null,null,null,null,null,null,null,null,null,null,null,null,null,null,null,null,null,null,null,null,null,null,null,null,null,null,null,null,null,null,null,null,null,null,null,null,null,null,null,null,null,null,null,null,null,null,null,null,null,null,null,null,null,null,null,null,null,null,null,null,null,null,null,null,null,null,null,null,null,null,null,null,null,null,null,null,null,null,null,null,null,null,null,null,"Rural Arterial/Collector 4-Lane Divided"]
[null,null,"State Road Number",null,null,null,null,null,null,null,null,null,null,null,null,null,null,null,null,null,null,null,null,null,null,null,null,null,null,null,null,null,null,null,null,null,null,null,null,null,null,null,null,null,null,null,null,null,null,null,null,null,null,null,null,null,null,null,null,null,null,null,null,null,null,null,null,null,null,null,null,null,null,null,null,null,null,null,null,null,null,null,null,null,null,null,null,null,null,null,null,null,null,null,null,null,null,null,null,null,null,null,null,null,null,null,null,null,null,null,null,null,null,null,null,null,null,null,null,null,null,null,null,null,null,null,null,null,null,null,null,null,null,null,null,null,null,null,null,null,null,null,null,null,null,null,null,null,null,null,null,null,null,null,null,null,null,null,null,null,null,null,null,null,null,null,null,null,null,null,null,null,null,null,null,null,null,null,null,null,null,null,null,null,null,null,null,null,null,null,null,null,null,null,null,null,null,null,null,null,null,null,null,null,null,null,null,null,null,null,null,null,null,null,null,null,null,null,null,null,null,null,null,null,null,null,null,null,null,null,null,null,null,null,null,null,null,null,null,null,null,null,null,null,null,null,null,null,null,null,null,null,null,null,null,"Rural Limited Access 4-Lane Divided"]
[null,null,"County",null,null,null,null,null,null,null,null,null,null,null,null,null,null,null,null,null,null,null,null,null,null,null,null,null,null,null,null,null,null,null,null,null,null,null,null,null,null,null,null,null,null,null,null,null,null,null,null,null,null,null,null,null,null,null,null,null,null,null,null,null,null,null,null,null,null,null,null,null,null,null,null,null,null,null,null,null,null,null,null,null,null,null,null,null,null,null,null,null,null,null,null,null,null,null,null,null,null,null,null,null,null,null,null,null,null,null,null,null,null,null,null,null,null,null,null,null,null,null,null,null,null,null,null,null,null,null,null,null,null,null,null,null,null,null,null,null,null,null,null,null,null,null,null,null,null,null,null,null,null,null,null,null,null,null,null,null,null,null,null,null,null,null,null,null,null,null,null,null,null,null,null,null,null,null,null,null,null,null,null,null,null,null,null,null,null,null,null,null,null,null,null,null,null,null,null,null,null,null,null,null,null,null,null,null,null,null,null,null,null,null,null,null,null,null,null,null,null,null,null,null,null,null,null,null,null,null,null,null,null,null,null,null,null,null,null,null,null,null,null,null,null,null,null,null,null,null,null,null,null,null,null,"Urban 4-Lane Arterial Divided (45 Mph)"]
[null,null,"Project Length",null,null,null,null,null,null,"1 Mile","1 Mile","1 Mile",null,"1 Mile",null,null,null,null,null,null,null,null,null,null,null,null,null,null,null,null,null,null,null,null,null,null,null,null,null,null,null,null,null,null,null,null,null,null,null,null,null,null,null,null,null,null,null,null,null,null,null,null,null,null,null,null,null,null,null,null,null,null,null,null,null,null,null,null,null,null,null,null,null,null,null,null,null,null,null,null,null,null,null,null,null,null,null,null,null,null,null,null,null,null,null,null,null,null,null,null,null,null,null,null,null,null,null,null,null,null,null,null,null,null,null,null,null,null,null,null,null,null,null,null,null,null,null,null,null,null,null,null,null,null,null,null,null,null,null,null,null,null,null,null,null,null,null,null,null,null,null,null,null,null,null,null,null,null,null,null,null,null,null,null,null,null,null,null,null,null,null,null,null,null,null,null,null,null,null,null,null,null,null,null,null,null,null,null,null,null,null,null,null,null,null,null,null,null,null,null,null,null,null,null,null,null,null,null,null,null,null,null,null,null,null,null,null,null,null,null,null,null,null,null,null,null,null,null,null,null,null,null,null,null,null,null,null,null,null,null,null,null,null,null,null,"Urban 6-Lane Arterial Divided (< 45Mph)"]
[null,null,"Roadway ID",null,null,null,null,null,null,null,null,null,null,null,null,null,null,null,null,null,null,null,null,null,null,null,null,null,null,null,null,null,null,null,null,null,null,null,null,null,null,null,null,null,null,null,null,null,null,null,null,null,null,null,null,null,null,null,null,null,null,null,null,null,null,null,null,null,null,null,null,null,null,null,null,null,null,null,null,null,null,null,null,null,null,null,null,null,null,null,null,null,null,null,null,null,null,null,null,null,null,null,null,null,null,null,null,null,null,null,null,null,null,null,null,null,null,null,null,null,null,null,null,null,null,null,null,null,null,null,null,null,null,null,null,null,null,null,null,null,null,null,null,null,null,null,null,null,null,null,null,null,null,null,null,null,null,null,null,null,null,null,null,null,null,null,null,null,null,null,null,null,null,null,null,null,null,null,null,null,null,null,null,null,null,null,null,null,null,null,null,null,null,null,null,null,null,null,null,null,null,null,null,null,null,null,null,null,null,null,null,null,null,null,null,null,null,null,null,null,null,null,null,null,null,null,null,null,null,null,null,null,null,null,null,null,null,null,null,null,null,null,null,null,null,null,null,null,null,null,null,null,null,null,null,"Urban 5-Lane Arterial/Collector Undivided"]
{"$rows_left_out":509}
{"sheet":"Graphs","index":6,"n_rows":1,"n_cols":12,"rows_kept":1,"cut":false,"hidden":false,"merged":[[0,0,0,10],[0,11,0,21]]}
["Financial Project ID:Urban 5-Lane Arterial/Collector Undivided, SR No.-, County:",null,null,null,null,null,null,null,null,null,null,"Financial Project ID:Urban 5-Lane Arterial/Collector Undivided, SR No.-, County:"]

{"sheet":"Report","index":7,"n_rows":48,"n_cols":15,"rows_kept":48,"cut":false,"hidden":false,"merged":[[15,5,15,7],[20,2,20,4],[11,5,11,7],[12,5,12,7],[13,5,13,7],[14,5,14,7],[1,1,1,11],[2,1,2,11],[3,1,3,11],[4,1,4,11],[10,5,10,7],[7,5,7,7],[25,5,25,7],[26,5,26,7],[27,5,27,7],[28,5,28,7],[34,2,34,4]]}
[]
[null,"FLORIDA DEPARTMENT OF TRANSPORTATION"]
[null,"PAVEMENT TYPE SELECTION"]
[null,"ECONOMIC ANALYSIS"]
[null,"COST PER MILE"]
[]
[]
[null,"Analysis Period:",null,null,40,"Years",null,null,"Discount Rate:",null,3.5000000000000003E-2]
[]
[null,"PCC PAVEMENT"]
{"$rows_left_out":39}
{"sheet":"Advanced Report","index":8,"n_rows":15,"n_cols":5,"rows_kept":15,"cut":false,"hidden":true,"merged":[[5,0,5,4],[6,0,6,4],[7,0,7,4],[1,0,1,4],[2,0,2,4],[3,0,3,4]]}
[]
["FLORIDA DEPARTMENT OF TRANSPORTATION"]
["PAVEMENT TYPE SELECTION"]
["DETAILED ECONOMIC ANALYSIS REPORT"]
[]
[{"$f":"IF('Basic Inputs'!$D$7=\"\",\"\",'Basic Inputs'!$C$7 & 'Basic Inputs'!$D$7 &\", \" & \"SR No.-\" &'Basic Inputs'!$D$8 & \", \" & \"County:\" & 'Basic Inputs'!$D$9)","v":""},{"$f":"IF('Basic Inputs'!$D$7=\"\",\"\",'Basic Inputs'!$C$7 & 'Basic Inputs'!$D$7)","v":""},{"$f":"IF('Basic Inputs'!$D$7=\"\",\"\",'Basic Inputs'!$C$7 & 'Basic Inputs'!$D$7)","v":""},{"$f":"IF('Basic Inputs'!$D$7=\"\",\"\",'Basic Inputs'!$C$7 & 'Basic Inputs'!$D$7)","v":""},{"$f":"IF('Basic Inputs'!$D$7=\"\",\"\",'Basic Inputs'!$C$7 & 'Basic Inputs'!$D$7)","v":""}]
[{"$f":"IF('Basic Inputs'!$D$7=\"\",\"\",'Basic Inputs'!$C$10&\" \"&'Basic Inputs'!$D$10&\", \"&'Basic Inputs'!$C$11&\" \"&'Basic Inputs'!$D$11)","v":""}]
[{"$f":"IF('Basic Inputs'!$D$7=\"\",\"\",'Basic Inputs'!$C$12&\" \"&'Basic Inputs'!$D$12&\", \"&'Basic Inputs'!$C$13&\" \"&'Basic Inputs'!$D$13)","v":""},{"$f":"IF('Basic Inputs'!$D$7=\"\",\"\",'Basic Inputs'!$C$12&\" \"&'Basic Inputs'!$D$12&\", \"&'Basic Inputs'!$C$13&\" \"&'Basic Inputs'!$D$13)","v":""},{"$f":"IF('Basic Inputs'!$D$7=\"\",\"\",'Basic Inputs'!$C$12&\" \"&'Basic Inputs'!$D$12&\", \"&'Basic Inputs'!$C$13&\" \"&'Basic Inputs'!$D$13)","v":""},{"$f":"IF('Basic Inputs'!$D$7=\"\",\"\",'Basic Inputs'!$C$12&\" \"&'Basic Inputs'!$D$12&\", \"&'Basic Inputs'!$C$13&\" \"&'Basic Inputs'!$D$13)","v":""},{"$f":"IF('Basic Inputs'!$D$7=\"\",\"\",'Basic Inputs'!$C$12&\" \"&'Basic Inputs'!$D$12&\", \"&'Basic Inputs'!$C$13&\" \"&'Basic Inputs'!$D$13)","v":""}]
[]
[]
{"$rows_left_out":6}
{"sheet":"Instructions","index":9,"n_rows":283,"n_cols":6,"rows_kept":283,"cut":false,"hidden":false,"merged":[[2,3,2,5],[58,3,58,5],[129,3,129,5],[145,3,145,5],[5,0,5,2],[6,0,6,2],[7,0,7,2],[277,3,277,5],[278,3,278,5],[8,0,8,2],[178,3,178,5],[214,3,214,5],[236,3,236,5],[276,3,276,5],[274,3,274,5],[0,0,0,2],[1,0,1,2],[2,0,2,2],[3,0,3,2],[4,0,4,2],[281,3,281,5],[282,3,282,5],[283,3,283,5],[279,3,279,5],[280,3,280,5]]}
["INDEX"]
["Simple Instructions"]
["Formulae",null,null,"INSTRUCTIONS"]
["Change Design Options Form"]
["Pavement Definitions"]
["Advanced Life Cycle Cost Analysis",null,null,"1.","Click the 'Select Roadway Typical Sections LCCA Data' button to load typical"]
["Graphs",null,null,null,"highway construction pay items and design options. Clicking this button will do the"]
["Saving and Retrieving Data",null,null,null,"following:"]
["Contact Information"]
[null,null,null,null,"i.","Create a list of typical construction items and the respective units that they are measured in."]
{"$rows_left_out":273}