{"text_format":"1","workbook":"xlsx","n_sheets":7,"sheets":["MainMenu","InputSheet","Calcs","OutputSheet","TurnSheets","Data","XML"],"not_rendered":{"charts":0,"images":59,"macros":1,"external_links":0,"defined_names":3,"comments":0,"pivot_tables":0},"unopened":[],"bounds":{"document_bytes":16777216,"sheet_cells":100000,"rows_first":2000,"rows_last":500,"rows_between":2000,"halvings":0,"cell_chars":16384,"cell_head_chars":4096},"cells_cut":0,"cells_raw":0,"read":"whole","date_system":"1900"}

{"sheet":"MainMenu","index":0,"n_rows":31,"n_cols":2,"rows_kept":31,"cut":false,"hidden":false,"merged":[[0,0,0,9],[1,0,1,9]]}
["TURNS5 Turning Movement Analysis Tool - V2014"]
["Main Menu"]
[]
[]
[]
[]
[]
[]
[]
[]
{"$rows_left_out":22}
{"sheet":"InputSheet","index":1,"n_rows":121,"n_cols":30,"rows_kept":121,"cut":false,"hidden":false,"merged":[[3,21,5,21],[63,4,63,5],[63,2,63,3],[34,8,36,11],[62,4,62,5],[31,4,33,4],[36,14,36,17],[7,2,8,4],[88,8,90,11],[31,3,33,3],[62,2,62,3],[61,8,63,11],[3,2,3,4],[9,2,9,4],[62,6,62,7],[0,8,0,13],[0,0,0,6],[61,4,61,5],[5,2,5,4],[6,2,6,4],[11,0,11,1],[61,2,61,3],[12,0,12,1],[61,6,61,7]]}
["TURNS5 ANALYSIS SHEET - INPUT",null,null,null,null,null,null,null,"Table Step 1a, directly below, contains unaltered DDHVs (not affected by any distribution required to run the macro).These values will feed into 'TurnSheets'."]
[]
[]
[null,"Analyst:",null,null,null,null,null,null,"Step 1a","Approach Volumes: Summarized AADT*K*D",null,null,null,null,null,"Step 1b","Departure Volumes: Summarized AADT*K*(1-D)",null,null,null,null,"Difference between Senter and Sexit. If positive, Sexit<Senter. If negative Sexit>Senter.",null,null,"Summarized AADT (Only used for TurnSheets graphic)"]
[null,"Date:",{"$f":"NOW()","v":"2019-05-16T10:22:52.340"},null,null,null,null,null,null,"From West:","From East:","From North:","From South:","Senter",null,null,"To West:","To East:","To North:","To South:","Sexit",null,null,null,null,"From West:","From East:","From North:","From South:","Senter"]
[null,"Highway:",null,null,null,null,null,null,"Year","EB Approach","WB Approach","SB Approach","NB Approach","TOTAL",null,"Year","WB Departure","EB Departure","NB Departure","SB Departure","TOTAL",null,"Senter=Sexit?",null,"Year","EB Approach","WB Approach","SB Approach","NB Approach","TOTAL"]
[null,"Intersection:",null,null,null,null,null,null,{"$f":"IF(Data!$B$2=\"yes\",$I$56,$I$42)","v":0},{"$f":"ROUND(IF($J$11=1,IF(Data!$B$2=\"yes\",ROUND($J$56,0),ROUND($J$42,0)),IF($J$11=2,IF(Data!$B$2=\"yes\",ROUND($J$83,0),ROUND($J$69,0)),IF(Data!$B$2=\"yes\",ROUND($J$110,0),ROUND($J$96,0))))*VLOOKUP(\"Eastbound (EB)\",$E$16:$F$20,2,FALSE)*IF(Data!$B$1=\"Yes\",$C$18,$C$16),0)","v":0},{"$f":"ROUND(IF($K$11=1,IF(Data!$B$2=\"yes\",ROUND($K$56,0),ROUND($K$42,0)),IF($K$11=2,IF(Data!$B$2=\"yes\",ROUND($K$83,0),ROUND($K$69,0)),IF(Data!$B$2=\"yes\",ROUND($K$110,0),ROUND($K$96,0))))*VLOOKUP(\"Westbound (WB)\",$E$16:$F$20,2,FALSE)*IF(Data!$B$1=\"Yes\",$C$18,$C$16),0)","v":0},{"$f":"ROUND(IF($L$11=1,IF(Data!$B$2=\"yes\",ROUND($L$56,0),ROUND($L$42,0)),IF($L$11=2,IF(Data!$B$2=\"yes\",ROUND($L$83,0),ROUND($L$69,0)),IF(Data!$B$2=\"yes\",ROUND($L$110,0),ROUND($L$96,0))))*VLOOKUP(\"Southbound (SB)\",$E$16:$F$20,2,FALSE)*IF(Data!$B$1=\"Yes\",$C$16,$C$18),0)","v":0},{"$f":"ROUND(IF($M$11=1,IF(Data!$B$2=\"yes\",ROUND($M$56,0),ROUND($M$42,0)),IF($M$11=2,IF(Data!$B$2=\"yes\",ROUND($M$83,0),ROUND($M$69,0)),IF(Data!$B$2=\"yes\",ROUND($M$110,0),ROUND($M$96,0))))*VLOOKUP(\"Northbound (NB)\",$E$16:$F$20,2,FALSE)*IF(Data!$B$1=\"Yes\",$C$16,$C$18),0)","v":0},{"$f":"SUM(J7:M7)","v":0},null,{"$f":"I7","v":0},{"$f":"ROUND(IF($J$11=1,IF(Data!$B$2=\"yes\",ROUND($J$56,0),ROUND($J$42,0)),IF($J$11=2,IF(Data!$B$2=\"yes\",ROUND($J$83,0),ROUND($J$69,0)),IF(Data!$B$2=\"yes\",ROUND($J$110,0),ROUND($J$96,0))))*(1-VLOOKUP(\"Eastbound (EB)\",$E$16:$F$20,2,FALSE))*IF(Data!$B$1=\"Yes\",$C$18,$C$16),0)","v":0},{"$f":"ROUND(IF($K$11=1,IF(Data!$B$2=\"yes\",ROUND($K$56,0),ROUND($K$42,0)),IF($K$11=2,IF(Data!$B$2=\"yes\",ROUND($K$83,0),ROUND($K$69,0)),IF(Data!$B$2=\"yes\",ROUND($K$110,0),ROUND($K$96,0))))*(1-VLOOKUP(\"Westbound (WB)\",$E$16:$F$20,2,FALSE))*IF(Data!$B$1=\"Yes\",$C$18,$C$16),0)","v":0},{"$f":"ROUND(IF($L$11=1,IF(Data!$B$2=\"yes\",ROUND($L$56,0),ROUND($L$42,0)),IF($L$11=2,IF(Data!$B$2=\"yes\",ROUND($L$83,0),ROUND($L$69,0)),IF(Data!$B$2=\"yes\",ROUND($L$110,0),ROUND($L$96,0))))*(1-VLOOKUP(\"Southbound (SB)\",$E$16:$F$20,2,FALSE))*IF(Data!$B$1=\"Yes\",$C$16,$C$18),0)","v":0},{"$f":"ROUND(IF($M$11=1,IF(Data!$B$2=\"yes\",ROUND($M$56,0),ROUND($M$42,0)),IF($M$11=2,IF(Data!$B$2=\"yes\",ROUND($M$83,0),ROUND($M$69,0)),IF(Data!$B$2=\"yes\",ROUND($M$110,0),ROUND($M$96,0))))*(1-VLOOKUP(\"Northbound (NB)\",$E$16:$F$20,2,FALSE))*IF(Data!$B$1=\"Yes\",$C$16,$C$18),0)","v":0},{"$f":"SUM(Q7:T7)","v":0},{"$f":"N7-U7","v":0},{"$f":"IF(N7=U7,\"Yes\",\"No\")","v":"Yes"},null,{"$f":"IF(Data!$B$2=\"yes\",$I$56,$I$42)","v":0},{"$f":"ROUND(IF($J$11=1,IF(Data!$B$2=\"yes\",ROUND($J$56,0),ROUND($J$42,0)),IF($J$11=2,IF(Data!$B$2=\"yes\",ROUND($J$83,0),ROUND($J$69,0)),IF(Data!$B$2=\"yes\",ROUND($J$110,0),ROUND($J$96,0)))),0)","v":0},{"$f":"ROUND(IF($K$11=1,IF(Data!$B$2=\"yes\",ROUND($K$56,0),ROUND($K$42,0)),IF($K$11=2,IF(Data!$B$2=\"yes\",ROUND($K$83,0),ROUND($K$69,0)),IF(Data!$B$2=\"yes\",ROUND($K$110,0),ROUND($K$96,0)))),0)","v":0},{"$f":"ROUND(IF($L$11=1,IF(Data!$B$2=\"yes\",ROUND($L$56,0),ROUND($L$42,0)),IF($L$11=2,IF(Data!$B$2=\"yes\",ROUND($L$83,0),ROUND($L$69,0)),IF(Data!$B$2=\"yes\",ROUND($L$110,0),ROUND($L$96,0)))),0)","v":0},{"$f":"ROUND(IF($M$11=1,IF(Data!$B$2=\"yes\",ROUND($M$56,0),ROUND($M$42,0)),IF($M$11=2,IF(Data!$B$2=\"yes\",ROUND($M$83,0),ROUND($M$69,0)),IF(Data!$B$2=\"yes\",ROUND($M$110,0),ROUND($M$96,0)))),0)","v":0},{"$f":"SUM(Z7:AC7)","v":0}]
[null,"Project:",null,null,null,null,null,null,{"$f":"IF(Data!$B$2=\"yes\",$I$57,$I$43)","v":0},{"$f":"ROUND(IF($J$11=1,IF(Data!$B$2=\"yes\",ROUND($J$57,0),ROUND($J$43,0)),IF($J$11=2,IF(Data!$B$2=\"yes\",ROUND($J$84,0),ROUND($J$70,0)),IF(Data!$B$2=\"yes\",ROUND($J$111,0),ROUND($J$97,0))))*VLOOKUP(\"Eastbound (EB)\",$E$16:$F$20,2,FALSE)*IF(Data!$B$1=\"Yes\",$C$18,$C$16),0)","v":0},{"$f":"ROUND(IF($K$11=1,IF(Data!$B$2=\"yes\",ROUND($K$57,0),ROUND($K$43,0)),IF($K$11=2,IF(Data!$B$2=\"yes\",ROUND($K$84,0),ROUND($K$70,0)),IF(Data!$B$2=\"yes\",ROUND($K$111,0),ROUND($K$97,0))))*VLOOKUP(\"Westbound (WB)\",$E$16:$F$20,2,FALSE)*IF(Data!$B$1=\"Yes\",$C$18,$C$16),0)","v":0},{"$f":"ROUND(IF($L$11=1,IF(Data!$B$2=\"yes\",ROUND($L$57,0),ROUND($L$43,0)),IF($L$11=2,IF(Data!$B$2=\"yes\",ROUND($L$84,0),ROUND($L$70,0)),IF(Data!$B$2=\"yes\",ROUND($L$111,0),ROUND($L$97,0))))*VLOOKUP(\"Southbound (SB)\",$E$16:$F$20,2,FALSE)*IF(Data!$B$1=\"Yes\",$C$16,$C$18),0)","v":0},{"$f":"ROUND(IF($M$11=1,IF(Data!$B$2=\"yes\",ROUND($M$57,0),ROUND($M$43,0)),IF($M$11=2,IF(Data!$B$2=\"yes\",ROUND($M$84,0),ROUND($M$70,0)),IF(Data!$B$2=\"yes\",ROUND($M$111,0),ROUND($M$97,0))))*VLOOKUP(\"Northbound (NB)\",$E$16:$F$20,2,FALSE)*IF(Data!$B$1=\"Yes\",$C$16,$C$18),0)","v":0},{"$f":"SUM(J8:M8)","v":0},null,{"$f":"I8","v":0},{"$f":"ROUND(IF($J$11=1,IF(Data!$B$2=\"yes\",ROUND($J$57,0),ROUND($J$43,0)),IF($J$11=2,IF(Data!$B$2=\"yes\",ROUND($J$84,0),ROUND($J$70,0)),IF(Data!$B$2=\"yes\",ROUND($J$111,0),ROUND($J$97,0))))*(1-VLOOKUP(\"Eastbound (EB)\",$E$16:$F$20,2,FALSE))*IF(Data!$B$1=\"Yes\",$C$18,$C$16),0)","v":0},{"$f":"ROUND(IF($K$11=1,IF(Data!$B$2=\"yes\",ROUND($K$57,0),ROUND($K$43,0)),IF($K$11=2,IF(Data!$B$2=\"yes\",ROUND($K$84,0),ROUND($K$70,0)),IF(Data!$B$2=\"yes\",ROUND($K$111,0),ROUND($K$97,0))))*(1-VLOOKUP(\"Westbound (WB)\",$E$16:$F$20,2,FALSE))*IF(Data!$B$1=\"Yes\",$C$18,$C$16),0)","v":0},{"$f":"ROUND(IF($L$11=1,IF(Data!$B$2=\"yes\",ROUND($L$57,0),ROUND($L$43,0)),IF($L$11=2,IF(Data!$B$2=\"yes\",ROUND($L$84,0),ROUND($L$70,0)),IF(Data!$B$2=\"yes\",ROUND($L$111,0),ROUND($L$97,0))))*(1-VLOOKUP(\"Southbound (SB)\",$E$16:$F$20,2,FALSE))*IF(Data!$B$1=\"Yes\",$C$16,$C$18),0)","v":0},{"$f":"ROUND(IF($M$11=1,IF(Data!$B$2=\"yes\",ROUND($M$57,0),ROUND($M$43,0)),IF($M$11=2,IF(Data!$B$2=\"yes\",ROUND($M$84,0),ROUND($M$70,0)),IF(Data!$B$2=\"yes\",ROUND($M$111,0),ROUND($M$97,0))))*(1-VLOOKUP(\"Northbound (NB)\",$E$16:$F$20,2,FALSE))*IF(Data!$B$1=\"Yes\",$C$16,$C$18),0)","v":0},{"$f":"SUM(Q8:T8)","v":0},{"$f":"N8-U8","v":0},{"$f":"IF(N8=U8,\"Yes\",\"No\")","v":"Yes"},null,{"$f":"IF(Data!$B$2=\"yes\",$I$57,$I$43)","v":0},{"$f":"ROUND(IF($J$11=1,IF(Data!$B$2=\"yes\",ROUND($J$57,0),ROUND($J$43,0)),IF($J$11=2,IF(Data!$B$2=\"yes\",ROUND($J$84,0),ROUND($J$70,0)),IF(Data!$B$2=\"yes\",ROUND($J$111,0),ROUND($J$97,0)))),0)","v":0},{"$f":"ROUND(IF($K$11=1,IF(Data!$B$2=\"yes\",ROUND($K$57,0),ROUND($K$43,0)),IF($K$11=2,IF(Data!$B$2=\"yes\",ROUND($K$84,0),ROUND($K$70,0)),IF(Data!$B$2=\"yes\",ROUND($K$111,0),ROUND($K$97,0)))),0)","v":0},{"$f":"ROUND(IF($L$11=1,IF(Data!$B$2=\"yes\",ROUND($L$57,0),ROUND($L$43,0)),IF($L$11=2,IF(Data!$B$2=\"yes\",ROUND($L$84,0),ROUND($L$70,0)),IF(Data!$B$2=\"yes\",ROUND($L$111,0),ROUND($L$97,0)))),0)","v":0},{"$f":"ROUND(IF($M$11=1,IF(Data!$B$2=\"yes\",ROUND($M$57,0),ROUND($M$43,0)),IF($M$11=2,IF(Data!$B$2=\"yes\",ROUND($M$84,0),ROUND($M$70,0)),IF(Data!$B$2=\"yes\",ROUND($M$111,0),ROUND($M$97,0)))),0)","v":0},{"$f":"SUM(Z8:AC8)","v":0}]
[null,null,null,null,null,null,null,null,{"$f":"IF(Data!$B$2=\"yes\",$I$58,$I$44)","v":0},{"$f":"ROUND(IF($J$11=1,IF(Data!$B$2=\"yes\",ROUND($J$58,0),ROUND($J$44,0)),IF($J$11=2,IF(Data!$B$2=\"yes\",ROUND($J$85,0),ROUND($J$71,0)),IF(Data!$B$2=\"yes\",ROUND($J$112,0),ROUND($J$98,0))))*VLOOKUP(\"Eastbound (EB)\",$E$16:$F$20,2,FALSE)*IF(Data!$B$1=\"Yes\",$C$18,$C$16),0)","v":0},{"$f":"ROUND(IF($K$11=1,IF(Data!$B$2=\"yes\",ROUND($K$58,0),ROUND($K$44,0)),IF($K$11=2,IF(Data!$B$2=\"yes\",ROUND($K$85,0),ROUND($K$71,0)),IF(Data!$B$2=\"yes\",ROUND($K$112,0),ROUND($K$98,0))))*VLOOKUP(\"Westbound (WB)\",$E$16:$F$20,2,FALSE)*IF(Data!$B$1=\"Yes\",$C$18,$C$16),0)","v":0},{"$f":"ROUND(IF($L$11=1,IF(Data!$B$2=\"yes\",ROUND($L$58,0),ROUND($L$44,0)),IF($L$11=2,IF(Data!$B$2=\"yes\",ROUND($L$85,0),ROUND($L$71,0)),IF(Data!$B$2=\"yes\",ROUND($L$112,0),ROUND($L$98,0))))*VLOOKUP(\"Southbound (SB)\",$E$16:$F$20,2,FALSE)*IF(Data!$B$1=\"Yes\",$C$16,$C$18),0)","v":0},{"$f":"ROUND(IF($M$11=1,IF(Data!$B$2=\"yes\",ROUND($M$58,0),ROUND($M$44,0)),IF($M$11=2,IF(Data!$B$2=\"yes\",ROUND($M$85,0),ROUND($M$71,0)),IF(Data!$B$2=\"yes\",ROUND($M$112,0),ROUND($M$98,0))))*VLOOKUP(\"Northbound (NB)\",$E$16:$F$20,2,FALSE)*IF(Data!$B$1=\"Yes\",$C$16,$C$18),0)","v":0},{"$f":"SUM(J9:M9)","v":0},null,{"$f":"I9","v":0},{"$f":"ROUND(IF($J$11=1,IF(Data!$B$2=\"yes\",ROUND($J$58,0),ROUND($J$44,0)),IF($J$11=2,IF(Data!$B$2=\"yes\",ROUND($J$85,0),ROUND($J$71,0)),IF(Data!$B$2=\"yes\",ROUND($J$112,0),ROUND($J$98,0))))*(1-VLOOKUP(\"Eastbound (EB)\",$E$16:$F$20,2,FALSE))*IF(Data!$B$1=\"Yes\",$C$18,$C$16),0)","v":0},{"$f":"ROUND(IF($K$11=1,IF(Data!$B$2=\"yes\",ROUND($K$58,0),ROUND($K$44,0)),IF($K$11=2,IF(Data!$B$2=\"yes\",ROUND($K$85,0),ROUND($K$71,0)),IF(Data!$B$2=\"yes\",ROUND($K$112,0),ROUND($K$98,0))))*(1-VLOOKUP(\"Westbound (WB)\",$E$16:$F$20,2,FALSE))*IF(Data!$B$1=\"Yes\",$C$18,$C$16),0)","v":0},{"$f":"ROUND(IF($L$11=1,IF(Data!$B$2=\"yes\",ROUND($L$58,0),ROUND($L$44,0)),IF($L$11=2,IF(Data!$B$2=\"yes\",ROUND($L$85,0),ROUND($L$71,0)),IF(Data!$B$2=\"yes\",ROUND($L$112,0),ROUND($L$98,0))))*(1-VLOOKUP(\"Southbound (SB)\",$E$16:$F$20,2,FALSE))*IF(Data!$B$1=\"Yes\",$C$16,$C$18),0)","v":0},{"$f":"ROUND(IF($M$11=1,IF(Data!$B$2=\"yes\",ROUND($M$58,0),ROUND($M$44,0)),IF($M$11=2,IF(Data!$B$2=\"yes\",ROUND($M$85,0),ROUND($M$71,0)),IF(Data!$B$2=\"yes\",ROUND($M$112,0),ROUND($M$98,0))))*(1-VLOOKUP(\"Northbound (NB)\",$E$16:$F$20,2,FALSE))*IF(Data!$B$1=\"Yes\",$C$16,$C$18),0)","v":0},{"$f":"SUM(Q9:T9)","v":0},{"$f":"N9-U9","v":0},{"$f":"IF(N9=U9,\"Yes\",\"No\")","v":"Yes"},null,{"$f":"IF(Data!$B$2=\"yes\",$I$58,$I$44)","v":0},{"$f":"ROUND(IF($J$11=1,IF(Data!$B$2=\"yes\",ROUND($J$58,0),ROUND($J$44,0)),IF($J$11=2,IF(Data!$B$2=\"yes\",ROUND($J$85,0),ROUND($J$71,0)),IF(Data!$B$2=\"yes\",ROUND($J$112,0),ROUND($J$98,0)))),0)","v":0},{"$f":"ROUND(IF($K$11=1,IF(Data!$B$2=\"yes\",ROUND($K$58,0),ROUND($K$44,0)),IF($K$11=2,IF(Data!$B$2=\"yes\",ROUND($K$85,0),ROUND($K$71,0)),IF(Data!$B$2=\"yes\",ROUND($K$112,0),ROUND($K$98,0)))),0)","v":0},{"$f":"ROUND(IF($L$11=1,IF(Data!$B$2=\"yes\",ROUND($L$58,0),ROUND($L$44,0)),IF($L$11=2,IF(Data!$B$2=\"yes\",ROUND($L$85,0),ROUND($L$71,0)),IF(Data!$B$2=\"yes\",ROUND($L$112,0),ROUND($L$98,0)))),0)","v":0},{"$f":"ROUND(IF($M$11=1,IF(Data!$B$2=\"yes\",ROUND($M$58,0),ROUND($M$44,0)),IF($M$11=2,IF(Data!$B$2=\"yes\",ROUND($M$85,0),ROUND($M$71,0)),IF(Data!$B$2=\"yes\",ROUND($M$112,0),ROUND($M$98,0)))),0)","v":0},{"$f":"SUM(Z9:AC9)","v":0}]
[null,"County:",null,null,null,null,null,null,{"$f":"IF(Data!$B$2=\"yes\",$I$59,$I$45)","v":0},{"$f":"ROUND(IF($J$11=1,IF(Data!$B$2=\"yes\",ROUND($J$59,0),ROUND($J$45,0)),IF($J$11=2,IF(Data!$B$2=\"yes\",ROUND($J$86,0),ROUND($J$72,0)),IF(Data!$B$2=\"yes\",ROUND($J$113,0),ROUND($J$99,0))))*VLOOKUP(\"Eastbound (EB)\",$E$16:$F$20,2,FALSE)*IF(Data!$B$1=\"Yes\",$C$18,$C$16),0)","v":0},{"$f":"ROUND(IF($K$11=1,IF(Data!$B$2=\"yes\",ROUND($K$59,0),ROUND($K$45,0)),IF($K$11=2,IF(Data!$B$2=\"yes\",ROUND($K$86,0),ROUND($K$72,0)),IF(Data!$B$2=\"yes\",ROUND($K$113,0),ROUND($K$99,0))))*VLOOKUP(\"Westbound (WB)\",$E$16:$F$20,2,FALSE)*IF(Data!$B$1=\"Yes\",$C$18,$C$16),0)","v":0},{"$f":"ROUND(IF($L$11=1,IF(Data!$B$2=\"yes\",ROUND($L$59,0),ROUND($L$45,0)),IF($L$11=2,IF(Data!$B$2=\"yes\",ROUND($L$86,0),ROUND($L$72,0)),IF(Data!$B$2=\"yes\",ROUND($L$113,0),ROUND($L$99,0))))*VLOOKUP(\"Southbound (SB)\",$E$16:$F$20,2,FALSE)*IF(Data!$B$1=\"Yes\",$C$16,$C$18),0)","v":0},{"$f":"ROUND(IF($M$11=1,IF(Data!$B$2=\"yes\",ROUND($M$59,0),ROUND($M$45,0)),IF($M$11=2,IF(Data!$B$2=\"yes\",ROUND($M$86,0),ROUND($M$72,0)),IF(Data!$B$2=\"yes\",ROUND($M$113,0),ROUND($M$99,0))))*VLOOKUP(\"Northbound (NB)\",$E$16:$F$20,2,FALSE)*IF(Data!$B$1=\"Yes\",$C$16,$C$18),0)","v":0},{"$f":"SUM(J10:M10)","v":0},null,{"$f":"I10","v":0},{"$f":"ROUND(IF($J$11=1,IF(Data!$B$2=\"yes\",ROUND($J$59,0),ROUND($J$45,0)),IF($J$11=2,IF(Data!$B$2=\"yes\",ROUND($J$86,0),ROUND($J$72,0)),IF(Data!$B$2=\"yes\",ROUND($J$113,0),ROUND($J$99,0))))*(1-VLOOKUP(\"Eastbound (EB)\",$E$16:$F$20,2,FALSE))*IF(Data!$B$1=\"Yes\",$C$18,$C$16),0)","v":0},{"$f":"ROUND(IF($K$11=1,IF(Data!$B$2=\"yes\",ROUND($K$59,0),ROUND($K$45,0)),IF($K$11=2,IF(Data!$B$2=\"yes\",ROUND($K$86,0),ROUND($K$72,0)),IF(Data!$B$2=\"yes\",ROUND($K$113,0),ROUND($K$99,0))))*(1-VLOOKUP(\"Westbound (WB)\",$E$16:$F$20,2,FALSE))*IF(Data!$B$1=\"Yes\",$C$18,$C$16),0)","v":0},{"$f":"ROUND(IF($L$11=1,IF(Data!$B$2=\"yes\",ROUND($L$59,0),ROUND($L$45,0)),IF($L$11=2,IF(Data!$B$2=\"yes\",ROUND($L$86,0),ROUND($L$72,0)),IF(Data!$B$2=\"yes\",ROUND($L$113,0),ROUND($L$99,0))))*(1-VLOOKUP(\"Southbound (SB)\",$E$16:$F$20,2,FALSE))*IF(Data!$B$1=\"Yes\",$C$16,$C$18),0)","v":0},{"$f":"ROUND(IF($M$11=1,IF(Data!$B$2=\"yes\",ROUND($M$59,0),ROUND($M$45,0)),IF($M$11=2,IF(Data!$B$2=\"yes\",ROUND($M$86,0),ROUND($M$72,0)),IF(Data!$B$2=\"yes\",ROUND($M$113,0),ROUND($M$99,0))))*(1-VLOOKUP(\"Northbound (NB)\",$E$16:$F$20,2,FALSE))*IF(Data!$B$1=\"Yes\",$C$16,$C$18),0)","v":0},{"$f":"SUM(Q10:T10)","v":0},{"$f":"N10-U10","v":0},{"$f":"IF(N10=U10,\"Yes\",\"No\")","v":"Yes"},null,{"$f":"IF(Data!$B$2=\"yes\",$I$59,$I$45)","v":0},{"$f":"ROUND(IF($J$11=1,IF(Data!$B$2=\"yes\",ROUND($J$59,0),ROUND($J$45,0)),IF($J$11=2,IF(Data!$B$2=\"yes\",ROUND($J$86,0),ROUND($J$72,0)),IF(Data!$B$2=\"yes\",ROUND($J$113,0),ROUND($J$99,0)))),0)","v":0},{"$f":"ROUND(IF($K$11=1,IF(Data!$B$2=\"yes\",ROUND($K$59,0),ROUND($K$45,0)),IF($K$11=2,IF(Data!$B$2=\"yes\",ROUND($K$86,0),ROUND($K$72,0)),IF(Data!$B$2=\"yes\",ROUND($K$113,0),ROUND($K$99,0)))),0)","v":0},{"$f":"ROUND(IF($L$11=1,IF(Data!$B$2=\"yes\",ROUND($L$59,0),ROUND($L$45,0)),IF($L$11=2,IF(Data!$B$2=\"yes\",ROUND($L$86,0),ROUND($L$72,0)),IF(Data!$B$2=\"yes\",ROUND($L$113,0),ROUND($L$99,0)))),0)","v":0},{"$f":"ROUND(IF($M$11=1,IF(Data!$B$2=\"yes\",ROUND($M$59,0),ROUND($M$45,0)),IF($M$11=2,IF(Data!$B$2=\"yes\",ROUND($M$86,0),ROUND($M$72,0)),IF(Data!$B$2=\"yes\",ROUND($M$113,0),ROUND($M$99,0)))),0)","v":0},{"$f":"SUM(Z10:AC10)","v":0}]
{"$rows_left_out":112}
{"sheet":"Calcs","index":2,"n_rows":318,"n_cols":23,"rows_kept":318,"cut":false,"hidden":false,"merged":[[29,3,32,5],[109,3,112,5],[189,3,192,5],[269,3,272,5]]}
["TURNFLOW - Intersection Turning Movement Program"]
[" (c) Mark C. Schaefer, May 1988, Version 1.00"]
[]
["Modified to Version 4.00, 10/95"]
["by Susan C. Newman / Richard Oujevolk - TEI Orlando, FL"]
["Adapted to Windows 2000, Windows XP, Microsoft Excel2003 by Mike Phillips and Loren Bloomberg CH2M HILL 5/2005"]
["Adapted to accept 3-way intersections by Amanda Schram and Nicholi Arnio RS&H 1/2014"]
["NOTE TO USERS:",null,null,null,null,null,null,null,null,null,null,"The total traffic into the intersection from approach i"]
[null,null,null,null,null,null,null,null,null,null,null,"The total flow out of the intersection to approach j"]
["PURPOSE:","This program computes a likely set of intersection turning movements ",null,null,null,null,null,null,null,null,null,"The total traffic flow from approach i to approach j (i.e. the turning movement from approach i to approach j)"]
{"$rows_left_out":309}
{"sheet":"OutputSheet","index":3,"n_rows":36,"n_cols":10,"rows_kept":36,"cut":false,"hidden":false,"merged":[[0,0,0,9],[9,2,9,3],[9,4,9,5],[9,6,9,7],[9,8,9,9],[5,3,6,5]]}
["TURNS5 INITIAL TURNING  VOLUME  SUMMARY "]
[]
[]
[null,"Highway:",null,{"$f":"InputSheet!C6","v":0},null,null,"County:",{"$f":"InputSheet!C10","v":0}]
[null,"Intersection:",null,{"$f":"InputSheet!C7","v":0}]
[null,"Project:",null,{"$f":"InputSheet!C8","v":0},null,null,"Analyst:",{"$f":"InputSheet!C4","v":0}]
[null,null,null,null,null,null,"Date:",{"$f":"InputSheet!C5","v":"2019-05-16T10:22:52.340"}]
[]
[]
[null,{"$f":"InputSheet!I7","v":0},{"$f":"B10","v":0},null,{"$f":"InputSheet!I8","v":0},null,{"$f":"InputSheet!I9","v":0},null,{"$f":"InputSheet!I10","v":0}]
{"$rows_left_out":27}
{"sheet":"TurnSheets","index":4,"n_rows":85,"n_cols":26,"rows_kept":85,"cut":false,"hidden":false,"merged":[[83,18,83,22],[3,3,3,7],[3,16,3,20],[23,3,23,7],[23,16,23,20],[47,3,47,7],[47,16,47,20],[67,3,67,7],[67,16,67,20],[83,14,83,16],[64,1,64,3],[64,14,64,16],[18,11,18,12],[19,11,19,12],[20,11,20,12],[21,11,21,12],[56,6,56,7],[56,19,56,20],[63,18,63,22],[65,1,65,11],[65,14,65,24],[70,9,71,11],[70,22,71,24],[45,1,45,11],[84,1,84,3],[84,14,84,16],[59,1,60,3],[59,14,60,16],[79,1,80,3],[79,14,80,16],[63,5,63,9],[83,5,83,9],[7,22,8,24],[17,24,17,25],[13,6,13,7],[10,3,10,4],[62,1,62,3],[62,14,62,16],[82,1,82,3],[82,14,82,16],[63,1,63,3],[63,14,63,16],[37,11,37,12],[38,11,38,12],[76,6,76,7],[76,19,76,20],[83,1,83,3],[17,11,17,12],[0,1,0,24],[20,18,20,19],[30,3,30,4],[40,5,40,6],[36,1,37,3],[30,16,30,17],[7,9,8,11],[16,1,17,3],[21,5,21,9],[18,1,18,2],[27,22,28,24],[27,9,28,11],[16,14,17,16],[24,19,24,20],[24,6,24,7],[19,18,19,19],[4,6,4,7],[4,19,4,20],[10,16,10,17],[22,14,22,24],[13,19,13,20],[2,1,2,11],[2,14,2,24],[22,1,22,11],[50,22,51,24],[53,3,53,4],[53,16,53,17],[43,1,43,24],[21,1,21,2],[21,18,21,22],[18,24,18,25],[19,24,19,25],[20,24,20,25],[21,24,21,25],[19,14,19,15],[20,14,20,15],[21,14,21,15],[18,14,18,15],[19,1,19,2],[38,1,38,2],[41,1,41,2],[20,1,20,2],[39,1,39,2],[40,1,40,2],[73,3,73,4],[73,16,73,17],[40,18,40,19],[33,6,33,7],[33,19,33,20],[36,14,37,16],[40,14,40,15],[37,24,37,25],[38,24,38,25],[39,24,39,25],[40,24,40,25],[41,24,41,25],[38,14,38,15],[39,14,39,15],[41,14,41,15],[41,5,41,9],[41,18,41,22],[39,11,39,12],[40,11,40,12],[41,11,41,12],[39,5,39,6],[39,18,39,19],[45,14,45,24],[50,9,51,11]]}
[null,{"$f":"\"PROJECT TRAFFIC FOR \"&InputSheet!$C$6&\" AT \"&InputSheet!$C$7&\"\"","v":"PROJECT TRAFFIC FOR  AT "}]
[]
[null,{"$f":"\"DESIGN HOUR TURNING MOVEMENTS IN YEAR \" &InputSheet!I7","v":"DESIGN HOUR TURNING MOVEMENTS IN YEAR 0"},null,null,null,null,null,null,null,null,null,null,null,null,{"$f":"\"DESIGN HOUR TURNING MOVEMENTS IN YEAR \" &InputSheet!I8","v":"DESIGN HOUR TURNING MOVEMENTS IN YEAR 0"}]
[null,null,null,{"$f":"IF(Data!$B$1=\"yes\",InputSheet!$C$6,InputSheet!$C$7)","v":0},null,null,null,null,null,null,null,null,null,null,null,null,{"$f":"IF(Data!$B$1=\"yes\",InputSheet!$C$6,InputSheet!$C$7)","v":0}]
[null,null,null,null,null,{"$f":"IF(InputSheet!$AB7<1000,MROUND(-InputSheet!$AB7,-10),IF(InputSheet!$AB7>=10000,MROUND(-InputSheet!$AB7,-1000),MROUND(-InputSheet!$AB7,-100)))","v":0},null,null,null,null,null,null,null,null,null,null,null,null,{"$f":"IF(InputSheet!$AB8<1000,MROUND(-InputSheet!$AB8,-10),IF(InputSheet!$AB8>=10000,MROUND(-InputSheet!$AB8,-1000),MROUND(-InputSheet!$AB8,-100)))","v":0}]
[null,null,null,null,null,{"$f":"InputSheet!$L7","v":0},null,null,null,null,null,null,null,null,null,null,null,null,{"$f":"InputSheet!$L8","v":0}]
[null,null,null,null,{"$f":"IF(Data!$B$5=0,1-G7,ROUND(Calcs!D70,3))","v":0},{"$f":"IF(F6=0,0,IF(Data!$B$5=0,0,1-E7-G7))","v":0},{"$f":"ROUND(Calcs!D71,3)","v":0},null,null,null,null,null,null,null,null,null,null,{"$f":"IF(Data!$B$5=0,1-T7,ROUND(Calcs!D150,3))","v":0},{"$f":"IF(S6=0,0,IF(Data!$B$5=0,0,1-R7-T7))","v":0},{"$f":"ROUND(Calcs!D151,3)","v":0}]
[null,null,null,null,{"$f":"IF(Data!$B$5=0,F6-G8,ROUND(E7*$F$6,0))","v":0},{"$f":"IF(Data!$B$5=0,0,F6-E8-G8)","v":0},{"$f":"ROUND(G7*$F$6,0)","v":0},null,null,{"$f":"IF(Data!$B$1=\"yes\",InputSheet!$C$7,InputSheet!$C$6)","v":0},null,null,null,null,null,null,null,{"$f":"IF(Data!$B$5=0,S6-T8,ROUND(R7*$S$6,0))","v":0},{"$f":"IF(Data!$B$5=0,0,S6-R8-T8)","v":0},{"$f":"ROUND(T7*$S$6,0)","v":0},null,null,{"$f":"IF(Data!$B$1=\"yes\",InputSheet!$C$7,InputSheet!$C$6)","v":0}]
[]
[null,null,null,null,null,null,null,null,null,{"$f":"IF(Data!$D$5=0,L11-J12,ROUND(K10*$L$11,0))","v":0},{"$f":"IF(Data!$D$5=0,1-K12,ROUND(Calcs!D66,3))","v":0},null,null,null,null,null,null,null,null,null,null,null,{"$f":"IF(Data!$D$5=0,Y11-W12,ROUND(X10*$Y$11,0))","v":0},{"$f":"IF(Data!$D$5=0,1-X12,ROUND(Calcs!D146,3))","v":0}]
{"$rows_left_out":76}
{"sheet":"Data","index":5,"n_rows":11,"n_cols":9,"rows_kept":11,"cut":false,"hidden":false,"merged":[]}
["Mainline N/S?","no","Automatic Estimating?",null,null,3,null,null,"PIN"]
["FSUTMS input?","no"]
["Intersection",4,"(3 or 4 legs?)"]
["Two-Way Selected",1,0,0,1]
["Three-Way Selected",1,1,1,1,"(value of 1 means approach is active) (NB, SB, EB, WB)"]
["Macro Run","no"]
["Errors","Growth"]
[null,1,1,"1=Linear, 2 = Exponential, 3 = Decaying for ML, side street"]
[]
[null,"N/S Road"]
{"$rows_left_out":2}
{"sheet":"XML","index":6,"n_rows":29,"n_cols":19,"rows_kept":29,"cut":false,"hidden":false,"merged":[]}
[null,"year","kmain","kside","OWDHTM_NB_T","OWDHTM_NB_RT","OWDHTM_NB_LT","OWDHTM_SB_T","OWDHTM_SB_RT","OWDHTM_SB_LT","OWDHTM_EB_T","OWDHTM_EB_RT","OWDHTM_EB_LT","OWDHTM_WB_T","OWDHTM_WB_RT","OWDHTM_WB_LT","NS_ROADNAME","EW_ROADNAME","NOTES"]
["EXISTING",{"$f":"InputSheet!I7","v":0},{"$f":"InputSheet!C16*100","v":7.0000000000000009},{"$f":"InputSheet!C18*100","v":7.0000000000000009},{"$f":"TurnSheets!H18","v":0},{"$f":"TurnSheets!I18","v":0},{"$f":"TurnSheets!G18","v":0},{"$f":"TurnSheets!F8","v":0},{"$f":"TurnSheets!G8","v":0},{"$f":"TurnSheets!E8","v":0},{"$f":"TurnSheets!D14","v":0},{"$f":"TurnSheets!D15","v":0},{"$f":"TurnSheets!D13","v":0},{"$f":"TurnSheets!J11","v":0},{"$f":"TurnSheets!J10","v":0},{"$f":"TurnSheets!J12","v":0},{"$f":"Data!$C$10","v":0},{"$f":"Data!$C$11","v":0}]
["OPEN",{"$f":"InputSheet!I8","v":0},{"$f":"InputSheet!C16*100","v":7.0000000000000009},{"$f":"InputSheet!C18*100","v":7.0000000000000009},{"$f":"TurnSheets!U18","v":0},{"$f":"TurnSheets!V18","v":0},{"$f":"TurnSheets!T18","v":0},{"$f":"TurnSheets!S8","v":0},{"$f":"TurnSheets!T8","v":0},{"$f":"TurnSheets!R8","v":0},{"$f":"TurnSheets!Q14","v":0},{"$f":"TurnSheets!Q15","v":0},{"$f":"TurnSheets!Q13","v":0},{"$f":"TurnSheets!W11","v":0},{"$f":"TurnSheets!W10","v":0},{"$f":"TurnSheets!W12","v":0},{"$f":"Data!$C$10","v":0},{"$f":"Data!$C$11","v":0}]
["MID",{"$f":"InputSheet!I9","v":0},{"$f":"InputSheet!C16*100","v":7.0000000000000009},{"$f":"InputSheet!C18*100","v":7.0000000000000009},{"$f":"TurnSheets!H38","v":0},{"$f":"TurnSheets!I38","v":0},{"$f":"TurnSheets!G38","v":0},{"$f":"TurnSheets!F28","v":0},{"$f":"TurnSheets!G28","v":0},{"$f":"TurnSheets!E28","v":0},{"$f":"TurnSheets!D34","v":0},{"$f":"TurnSheets!D35","v":0},{"$f":"TurnSheets!D33","v":0},{"$f":"TurnSheets!J31","v":0},{"$f":"TurnSheets!J30","v":0},{"$f":"TurnSheets!J32","v":0},{"$f":"Data!$C$10","v":0},{"$f":"Data!$C$11","v":0}]
["DESIGN",{"$f":"InputSheet!I10","v":0},{"$f":"InputSheet!C16*100","v":7.0000000000000009},{"$f":"InputSheet!C18*100","v":7.0000000000000009},{"$f":"TurnSheets!U38","v":0},{"$f":"TurnSheets!V38","v":0},{"$f":"TurnSheets!T38","v":0},{"$f":"TurnSheets!S28","v":0},{"$f":"TurnSheets!T28","v":0},{"$f":"TurnSheets!R28","v":0},{"$f":"TurnSheets!Q34","v":0},{"$f":"TurnSheets!Q35","v":0},{"$f":"TurnSheets!Q33","v":0},{"$f":"TurnSheets!W31","v":0},{"$f":"TurnSheets!W30","v":0},{"$f":"TurnSheets!W32","v":0},{"$f":"Data!$C$10","v":0},{"$f":"Data!$C$11","v":0}]
[]
[]
[]
[]
[]
{"$rows_left_out":19}